{"text_format":"1","workbook":"xlsx","n_sheets":7,"sheets":["Grille","Modèles Bell","Modèles HQ","Code travaux","FAQ","Tableau 19 Norme commune","DATA"],"not_rendered":{"charts":0,"images":17,"macros":1,"external_links":0,"defined_names":7,"comments":0,"pivot_tables":0},"unopened":[],"bounds":{"document_bytes":16777216,"sheet_cells":100000,"rows_first":2000,"rows_last":500,"rows_between":2000,"halvings":0,"cell_chars":16384,"cell_head_chars":4096},"cells_cut":0,"cells_raw":0,"read":"whole","date_system":"1900"}

{"sheet":"Grille","index":0,"n_rows":52,"n_cols":322,"rows_kept":52,"cut":false,"hidden":false,"merged":[[10,0,10,8],[11,0,11,8],[50,2,50,7],[36,0,36,8],[37,5,37,7],[37,0,37,4],[41,0,41,8],[34,0,34,1],[35,0,35,1],[35,3,35,5],[35,6,35,8],[34,6,34,8],[34,3,34,5],[38,5,38,7],[38,0,38,4],[39,5,39,8],[51,0,51,8],[42,0,42,8],[46,0,49,3],[46,4,47,4],[48,4,49,4],[45,0,45,3],[45,4,45,8],[46,5,47,8],[48,5,49,8],[43,0,43,8],[44,0,44,8],[39,0,39,4],[40,0,40,4],[0,1,0,3],[0,5,0,6],[1,5,1,8],[12,5,14,5],[12,6,14,6],[2,1,2,3],[3,1,3,3],[4,1,4,3],[2,4,2,8],[4,4,4,8],[3,4,3,8],[5,3,5,4],[13,4,14,4],[40,5,40,8]]}
["POTEAU",null,null,null,"PROJET",null,null,"Révision"]
["Travaux",null,"Dia. câble add.",null,"Classification\nTravaux Bell"]
["Anomalie 1"]
["Anomalie 2"]
["Anomalie 3",null,null,null,null,null,null,null,null,null,null,null,null,null,null,null,null,null,null,null,null,null,null,null,null,null,null,null,null,null,null,null,null,null,null,null,null,null,null,null,null,null,null,null,null,null,null,null,null,null,null,null,null,null,null,null,null,null,null,null,null,null,null,null,null,null,null,null,null,null,null,null,null,null,null,null,null,null,null,null,null,null,null,null,null,null,null,null,null,null,null,null,null,null,null,null,null,null,null,null,null,null,null,null,null,null,null,null,null,null,null,null,null,null,null,null,null,null,null,null,null,null,null,null,null,null,null,null,null,null,null,null,null,null,null,null,null,null,null,null,null,null,null,null,null,null,null,null,null,null,null,null,null,null,null,null,null,null,null,null,null,null,null,null,null,null,null,null,null,null,null,null,null,null,null,null,null,null,null,null,null,null,null,null,null,null,null,null,null,null,null,null,null,null,null,null,null,null,null,null,null,null,null,null,null,null,null,null,null,null,null,null,null,null,null,null,null,null,null,null,null,null,null,null,null,null,null,null,null,null,null,null,null,null,null,null,null,null,null,null,null,null,null,null,null,null,null,null,null,null,null,null,null,null,null,null,null,null,null,null,null,null,null,null,null,null,null,null,null,null,null,null,null,null,null,null,null,null,null,null,null,null,null,null,null,null,null,null,null,null,null,null,null,null,null,null,null,null,null,null,null,null,null,null,null,null,null,null,null,null,null,null,null,null,null,null,null,null,null,null,null," "]
["Nom poteau",null,"Adresse",null,null,"Plan",null,"Code à barre"]
["Pro. poteau",null,"Usage com.",null,"Parc",null,null,"LCLCL"]
["Longueur",null,"Classe",null,"Année",null,"Transformateur"]
["Année insp.",null,"Modèle Bell",null,"Modèle HQ",null,"Autre équip."]
["Fossé ",null,"Lampadaire ",null,"Cabinet",null,"Bas de Cuve"]
["Aucun Travaux/ Travaux sur opportunité remplir les cases bleues pâle seulement"]
["Travaux critiques, remplir toutes les cases de la Grille RSA"]
["TOP","Portée pre.","Portée sui.","Portée dér.","Toron ins.","Milieu",null,"Dég. Sol Exp.",{"$f":"IFERROR(DATA!G13, \"\")","v":""}]
[null,null,null,null,null,null,null,"Dég. Sol CSA",{"$f":"IFERROR(DATA!H13, \"\")","v":""}]
["MT ","Conducteur","Phases","Dérivation",null,null,null,"Dég.  BT-COM",{"$f":"IFERROR(DATA!F32-DATA!F33,\"\")","v":""}]
[null,null,null,null,"ANCRES",1,2,3,4]
[null,null,null,null,"Type de sol"]
[null,null,null,null,"Tige"]
[null,null,null,null,"Cosses"]
[null,null,null,null,"Ancre"]
["BT ","Conducteur","Visée","Dérivation","Écart (m)"]
[null,null,null,null,"Hauban 1"]
[null,null,null,null,"Hauban 2"]
[null,null,null,null,"Hauban 3"]
[null,null,null,null,"Hauban 4"]
[null,null,null,null,"État"]
[null,null,null,null,"Espace dis.(m)"]
["Télécom","Propriétaire","Type","Nb de câbles","Diamètre (mm)","Rupture (%)","Dég. sol. ","Croisement","Ancre"]
[]
[]
[]
[]
[]
[]
["Ligne haute tension",null,"Dis. Appro  < 3m","Élément sensible",null,null,"Coordonnées GPS (facultatif)"]
[]
["Description des travaux"]
[null,null,null,null,null,"Travaux effectués  par le tiers"]
[null,null,null,null,null,"Code de travaux "]
[null,null,null,null,null,"Méthodologie de travail (Facultatif)"]
[]
["Commentaires Additionnels"]
[]
[]
[]
["Approbation ingénieur",null,null,null,"Releveur"]
[null,null,null,null,"Nom"]
[]
[null,null,null,null,"Date"]
[]
["V 4.0 17-06-2021",null,"Analyse de risque favorable"]
[{"$f":"IF(I51=\"Oui\",DATA!A9,\" \")","v":" "}]

{"sheet":"Modèles Bell","index":1,"n_rows":108,"n_cols":3,"rows_kept":108,"cut":false,"hidden":false,"merged":[[104,1,120,1],[6,1,21,1],[22,1,41,1],[42,1,63,1],[64,1,83,1],[84,1,103,1]]}
[]
[null,null,"Modèles Bell"]
[null,null,"Un seul coût de Transfert, de Réarrangement, de Fixation, de détachement/enlèvement d’Hauban (s’il n’y a pas d’enlèvement de Toron ou de câble) ou de Retentionnement des Attaches par Poteau doit être utilisé pour la réalisation des travaux mentionnés aux modèles selon les figures ci-dessous des Attaches en place actuellement. \nDans les cas où il y a un événement Poteau et un événement Ancre sur le même élément réseau, l’événement Poteau a préséance et doit être choisi. \n"]
[]
[]
[]
[null,"1A"]
[null,null,"Modèle Compagnie-1A (Transfert, Réarrangement, Fixation et Retensionnement des Attaches)"]
[null,null,"Sans contrainte "]
[]
[null,null,"1 ou plusieurs fils de service seulement"]
[null,null,"avec ou sans Hauban"]
[]
[]
[]
[]
[]
[]
[]
[]
[]
[]
[null,1]
[null,null,"Transfert, Réarrangement, Fixation et Retentionnement des Attaches"]
[null,null,"Sans contrainte "]
[]
[null,null,"1 ou plusieurs Torons"]
[null,null,"1 ou plusieurs fils de service"]
[null,null,"avec ou sans Hauban"]
[null,null,"(Utiliser ce modèle pour le remplacement de poteau d'haubanage) "]
[]
[]
[]
[]
[]
[]
[]
[]
[]
[]
[]
[]
[null,2]
[null,null,"Transfert, Réarrangement, Fixation, et Retensionnement des Attaches"]
[null,null,"Sans contrainte "]
[]
[null,null,"1 ou plusieurs Torons"]
[null,null,"1 ou plusieurs fils de service"]
[null,null,"avec ou sans Hauban"]
[null,null,"avec boîtier de raccordement fixé aux câbles ou sur Poteau ou boîtier d'épissures"]
[]
[]
[]
[]
[]
[]
[]
[]
[]
[]
[]
[]
[]
[]
[null,3]
[null,null,"Transfert, Réarrangement, Fixation, et Retentionnement des Attaches"]
[null,null,"Avec contrainte "]
[]
[null,null,"1 ou plusieurs Torons"]
[null,null,"1 ou plusieurs fils de service"]
[null,null,"avec ou sans Hauban"]
[null,null,"avec boîtier de raccordement fixé aux câbles ou sur Poteau ou boîtier d'épissures"]
[null,null,"avec un ou plusieurs câbles en montée aérosouterraine"]
[]
[]
[]
[]
[]
[]
[]
[]
[]
[]
[]
[null,4]
[null,null,"Transfert, Réarrangement, Fixation, et Retentionnement des Attaches"]
[null,null,"Avec contrainte "]
[]
[null,null,"1 ou plusieurs Torons"]
[null,null,"1 ou plusieurs fils de service"]
[null,null,"avec ou sans Hauban"]
[null,null,"avec boîtier de raccordement fixé aux câbles ou sur Poteau ou boîtier d'épissures"]
[null,null,"avec un ou plusieurs câbles en montée aérosouterraine"]
[null,null,"avec boîtier de pupinisation, boîtier d'interconnexion (QCCE, BJI, IBV),CPN et CSP), avec ou sans balcon, coffret répéteur, concentrateur de Ligne,Antenne"]
[]
[]
[]
[]
[]
[]
[]
[]
[]
[]
[null,5]
[null,null,"Transfert, Réarrangement, Fixation et Retentionnement des Attaches)"]
[null,null,"Sans contrainte "]
[null,null,"1 ou plusieurs Haubans"]

{"sheet":"Modèles HQ","index":2,"n_rows":130,"n_cols":3,"rows_kept":130,"cut":false,"hidden":false,"merged":[[84,1,103,1],[104,1,126,1],[127,1,145,1],[6,1,21,1],[22,1,41,1],[42,1,63,1],[64,1,83,1]]}
[]
[null,null,"Modèles HQ"]
[]
[]
[]
[]
[null,"1A"]
[null,null,"Modèle Société-1A (Transfert, Réarrangement, Fixation et Retensionnement des Attaches)"]
[null,null,"Sans contrainte  "]
[]
[null,null,"réseau ou branchement basse tension seulement"]
[null,null,"avec ou sans console luminaire"]
[null,null,"avec ou sans Hauban"]
[null,null,"incluant les Attaches en fin de course"]
[]
[]
[]
[]
[]
[]
[]
[]
[null,1]
[null,null,"Modèle Société-1 (Transfert, Réarrangement, Fixation et Retensionnement des Attaches"]
[null,null,"Sans contrainte "]
[]
[null,null,"réseau moyenne tension 1 phase et basse tension"]
[null,null,"avec ou sans branchement basse tension"]
[null,null,"avec ou sans console luminaire"]
[null,null,"avec ou sans Hauban"]
[null,null,"avec ou sans dérivation"]
[null,null,"incluant les Attaches en fin de course"]
[null,null,"(Utiliser ce modèle pour le remplacement de poteau d'haubanage) "]
[]
[]
[]
[]
[]
[]
[]
[]
[]
[null,2]
[null,null,"Modèle Société-2 (Transfert, Réarrangement, Fixation et Retentionnement des Attaches"]
[null,null,"Sans contrainte "]
[]
[null,null,"réseau moyenne tension 1 phase et basse tension"]
[null,null,"avec 1 transformateur et accessoire, coupe-circuit et/ou sectionneur unipolaire"]
[null,null,"avec ou sans branchement basse tension"]
[null,null,"avec ou sans Hauban"]
[null,null,"avec ou sans dérivation"]
[null,null,"incluant les Attaches en fin de course"]
[]
[]
[]
[]
[]
[]
[]
[]
[]
[]
[]
[]
[null,3]
[null,null,"Modèle Société-3 (Transfert, Réarrangement, Fixation et Retentionnement des Attaches)"]
[null,null,"Sans contrainte "]
[]
[null,null,"réseau moyenne tension 2 ou 3 phases et basse tension"]
[null,null,"avec ou sans branchement basse tension"]
[null,null,"avec ou sans console luminaire"]
[null,null,"avec ou sans Hauban"]
[null,null,"avec ou sans dérivation"]
[null,null,"incluant les Attaches en fin de course"]
[]
[]
[]
[]
[]
[]
[]
[]
[]
[]
[null,4]
[null,null,"Modèle Société-4 (Transfert, Réarrangement, Fixation et Retentionnement des Attaches) "]
[null,null,"Sans contrainte "]
[]
[null,null,"réseau moyenne tension 2 ou 3 phases et basse tension"]
[null,null,"avec 1 ou plusieurs transformateurs et accessoires, coupe-circuit CC1, CC3/ou sectionneur unipolaire"]
[null,null,"avec ou sans branchement basse tension"]
[null,null,"avec ou sans console luminaire"]
[null,null,"avec ou sans Hauban"]
[null,null,"avec ou sans dérivation"]
[null,null,"incluant les Attaches en fin de course"]
[]
[]
[]
[]
[]
[]
[]
[]
[]
[null,5]
[null,null,"Modèle Société-5 (Transfert, Réarrangement, Fixation et Retentionnement des Attaches) "]
[null,null,"Avec contrainte "]
[]
[null,null,"réseau moyenne tension 1, 2 ou 3 phases et basse tension"]
[null,null,"avec condensateur, interrupteur VBM, interrupteur SF6, interrupteur S&G au SF-6, disjoncteur, phases verticales ou biternes"]
[null,null,"avec ou sans console luminaire"]
[null,null,"avec ou sans Hauban"]
[]
[]
[]
[]
[]
[]
[]
[]
[]
[]
[]
[]
[]
[]
[]
[null,6,"Modèle Société-6 (Transfert, Réarrangement, Fixation et Retentionnement des Attaches) "]
[null,null,"Sans contrainte "]
[null,null,"1 ou plusieurs Haubans"]

{"sheet":"Code travaux","index":3,"n_rows":14,"n_cols":3,"rows_kept":14,"cut":false,"hidden":false,"merged":[[3,1,11,1],[12,1,13,1]]}
[]
[]
[null,"Code","TRAVAUX AÉRIENS AUTORISÉS / PRIS EN CHARGE PAR LES TITULAIRES"]
[null,614,"Le titulaire est autorisé à procéder aux travaux planteurs :"]
[null,null,"Ces travaux doivent être réalisés par un entrepreneur Bell autorisé"]
[null,null,"a) Remplacer un poteau"]
[null,null,"b) Remplacer une ancre"]
[null,null,"c) Ajouter un poteau"]
[null,null,"d) Ajouter une ancre"]
[null,null,"e) Ajouter une tige d'extension"]
[null,null,"f)  Retirer un poteau"]
[null,null,"g) Retirer une ancre"]
[null,615,"Le titulaire est autorisé à transférer les attaches de Bell (toron et/ou hauban) "]
[null,null,"Ces travaux doivent être réalisés par un entrepreneur Bell autorisé"]

{"sheet":"FAQ","index":4,"n_rows":17,"n_cols":2,"rows_kept":17,"cut":false,"hidden":true,"merged":[]}
[]
[]
[]
[]
[null,"À VENIR: ONGLET AVEC LES RÉPONSES AUX QUESTIONS LES PLUS FRÉQUENTES"]
[]
[]
[]
[]
["QUESTION:","QUE VEUX DIRE LA CASE XYZ"]
[]
["RÉPONSE: "]
[]
[]
["QUESTION:"]
[]
["RÉPONSE:"]

{"sheet":"Tableau 19 Norme commune","index":5,"n_rows":41,"n_cols":6,"rows_kept":41,"cut":false,"hidden":false,"merged":[]}
[]
[]
[]
[]
[]
[]
[]
[]
[]
[]
[]
[]
[]
[]
[]
[]
[]
[]
[]
[]
[]
[]
[]
[]
[]
[]
[]
[]
[]
[]
[]
[]
[]
[]
[]
[]
[]
[]
[]
[]
[null,null,null,null,"Tableau 19","Extrait de la norme UC-Structure-poteau"]

{"sheet":"DATA","index":6,"n_rows":76,"n_cols":9,"rows_kept":76,"cut":false,"hidden":true,"merged":[]}
[]
[]
[]
[]
[]
[]
[]
["Analyse de risque favorable"]
["Cette analyse est un avis technique fondé sur les calculs d’un ingénieur démontrant que la dérogation à la « NORME POUR LA CONCEPTION, L’INSTALLATION ET LA VÉRIFICATION DES STRUCTURES AÉRIENNES », telle qu’approuvée par un ingénieur, ne présente pas de risques significatifs pour l’intégrité des structures, la sécurité du public et des travailleurs. Le titulaire sera présumé responsable de tout dommage à cette structure pouvant raisonnablement être attribuable à cette dérogation à la NORME POUR LA CONCEPTION, L’INSTALLATION ET LA VÉRIFICATION DES STRUCTURES AÉRIENNES à moins de preuve du contraire et ce, jusqu’à ce que les travaux préparatoires soient complétés de manière à ce que la structure soit conforme à la NORME POUR LA CONCEPTION, L’INSTALLATION ET LA VÉRIFICATION DES STRUCTURES AÉRIENNES. En signant ce formulaire le titulaire assume les risques reliés à ces travaux et reconnaît que les clauses 2.2, 4.1, 5.3, 6.1 et 7.1 du contrat CLRSS s’appliquent. Les recommandations prescrites, ci-bas, doivent être respectées. \nTous les employés et entrepreneurs doivent être qualifiés en santé et sécurité pour les travaux en hauteurs, voir document « Directives en matière de santé et sécurité à l’intention des entrepreneurs, Module sur le Travail en hauteur » de Bell.\n \nNote 1 : La date du relevé doit être inférieure à un an de la date du formulaire analyse de risque.\n"]
[]
[]
[null,"OPTION BELL",null,null,null,"Milieu","EXP","CSA"]
[null,"0- Sans travaux (Ne remplir que les cases foncées de la grille)",null,null,null,{"$f":"Grille!G13","v":0},{"$f":"VLOOKUP(F13,F18:H26,2,FALSE)","v":{"$error":"#N/A"}},{"$f":"VLOOKUP(G13,G18:I26,2,FALSE)","v":{"$error":"#N/A"}}]
[null,"1- Travaux sur opportunité (Ne remplir que les cases foncées de la grille)"]
[null,"2- Travaux critiques avec dérogation possible (Remplir la grille complète)"]
[null,"3- Travaux critiques sans dérogation possible (Remplir la grille complète)"]
[null,null,null,null,null,"Milieu"]
[null,"ANOMALIE",null,null,null,"Arrière-lot",3,2.5]
[null,"ANCRE ENTERRÉE",null,null,null,"Avant-lot",5,4.42]
[null,"ANCRE SORTIE + de 50cm",null,null,null,"Industriel",5,4.42]
[null,"POTEAU INCLINÉ",null,null,null,"Rural chemin",5.5,4.42]
[null,"CROISEMENT DE TORON",null,null,null,"Rural sans chemin",4.2,3]
[null,"ANOMALIE ÉLECTRIQUE ",null,null,null,"Client avant-lot",5,4.4000000000000004]
[null,"DÉGAGEMENT ENTRE BT ET COM INSUFFISANT",null,null,null,"Client arrière-lot",3,2.5]
[null,"PORTÉE LÂCHE AU DESSUS D'UNE VOIE DE CIRCULATION",null,null,null,"Haubannage urbain",5,4.42]
[null,"TORONS EN FIN DE COURSE NON-HAUBANNÉE",null,null,null,"Haubannage rural",3,2.5]
[]
[null,"TYPE"]
[]
["CAT","DÉTAIL"]
["POTEAU","Poteau incliné de 5 à 10°",null,null,null,"dégagement"]
["POTEAU","POTEAU INCLINÉ DE + de 10°",null,null,"BT plus basse",{"$f":"SMALL(Grille!A22:A27,1)","v":{"$error":"#NUM!"}}]
["POTEAU","POTEAU DE HAUTEUR INSUFFISANTE",null,null,"Toron utilisé",{"$f":"VLOOKUP(Grille!E14,DATA!E39:F44,2,FALSE)","v":{"$error":"#N/A"}}]
["POTEAU","POTEAU DÉSUET"]
["POTEAU","POTEAU ENDOMMAGÉ"]
["ANCRE","ANCRE ENTERRÉ"]
["ANCRE","ANCRE DÉTERRÉ (Tige sortie > 50 cm)"]
["ANCRE","ANCRE SURCHARGÉ (nbre. Haubans > nbre. cosses)"]
["HAUBAN","HAUBAN LÂCHE",null,null,1,{"$f":"Grille!A29","v":0}]
["HAUBAN","HAUBAN AVEC PLUSIEURS BRINS CASSÉS",null,null,2,{"$f":"Grille!A30","v":0}]
["HAUBAN","HAUBAN COUPÉ",null,null,3,{"$f":"Grille!A31","v":0}]
["HAUBAN","HAUBAN MANQUANT",null,null,4,{"$f":"Grille!A32","v":0}]
["HAUBAN","PROTÈGE HAUBANT MANQUANT",null,null,5,{"$f":"Grille!A33","v":0}]
["DÉGAGEMENT","DÉGAGEMENT AU SOL NON RESPECTÉ",null,null,6,{"$f":"Grille!A34","v":0}]
["DÉGAGEMENT","DÉGAGEMENT NEUTRE NON RESPECTÉ"]
["DÉGAGEMENT","CROISEMENT DE TORON"]
["DÉGAGEMENT","VISÉE"]
["MALT","MALT COUPÉ DANS LA ZONE TÉLÉCOM"]
["MALT","MALT COUPÉ DANS LA ZONE HQ"]
["AUTRE","DOCUMENTER LA SECTION \"AUTRES OBSERVATIONS\""]
[]
[]
[null,null,null,"Poteau","Ancre","Hauban","Dégagement","Montage","Autre"]
[null,null,null,"Poteau incliné de 5 à 10°","Ancre enterré","Hauban lâche","Dégagement avec le sol non respecté","Portée lâche hors norme","Détailler dans la section \"Autres observations"]
[null,null,null,"Poteau incliné + de 10°","Ancre déterré (Tige sortie > 50 cm)","Hauban avec plusieurs brins cassés","Dégagement avec la basse tension non respecté","Fin de course non haubanné"]
[null,null,null,"Poteau ayant une hauteur insuffisante","Ancre surchargé (nbre. Haubans > nbre. cosses)","Hauban coupé","Croisement de torons "]
[null,null,null,"Poteau ayant une classe insuffisante",null,"Hauban lâche sur ancre enterrée/endommagée","Visée"]
[null,null,null,"Poteau endommagé",null,"Hauban manquant"]
[null,null,null,"Malt coupé dans la zone HQ",null,"Protège hauban manquant"]
[null,null,null,"MALT coupé dans la zone télécom "]
[null,null,null,"Anomalie électrique"]
[]
[]
[]
[]
[null,null,null,"CODE TRAVAUX 600"]
[]
[null,null,null,"614a"]
[null,null,null,"614b"]
[null,null,null,"614c"]
[null,null,null,"614d"]
[null,null,null,"614e"]
[null,null,null,"614f"]
[null,null,null,"614g"]
[null,null,null,614]
[null,null,null,615]